{"text_format":"2","workbook":"xlsx","n_sheets":8,"sheets":["Basisgegevens","Dyslexie - 45A45","Dyslexie - 45A64","Toelichting","Bruto-netto en pensioen","Overzicht bouwstenen","Invulblad CAO","Pensioenpremie CAO"],"not_rendered":{"charts":0,"images":0,"macros":0,"external_links":0,"defined_names":29,"comments":0,"pivot_tables":0},"unopened":[],"bounds":{"document_bytes":16777216,"sheet_cells":100000,"run_cost":"one","rows_first":2000,"rows_last":500,"rows_between":2000,"halvings":0,"cell_chars":16384,"cell_head_chars":4096},"cells_cut":0,"cells_raw":0,"read":"whole","date_system":"1900"}

{"sheet":"Basisgegevens","index":0,"n_rows":10,"n_cols":3,"rows_kept":10,"cut":false,"hidden":false,"merged":[]}
[]
[null,"Naam organisatie:"]
[null,"Naam:"]
[null,"Eigen verklaring:","Met het invullen en opsturen van de kostprijs-gegevens voor bouwstenen jeugdhulp verklaar ik dat deze informatie te goeder trouw realistisch is ingevuld."]
[]
[null,"Datum:"]
[]
[]
[null,"Deze rekentool bevat de ambulante bouwstenen dyslexie die worden uitgevraagd voor het kostprijsonderzoek voor Zuid-Drenthe."]
[null,"Vult u graag de rekentool in voor alle bouwstenen die uw organisatie levert in Zuid-Drenthe, elk op het corresponderende tabblad."]

{"sheet":"Dyslexie - 45A45","index":1,"n_rows":40,"n_cols":21,"rows_kept":40,"cut":false,"hidden":false,"merged":[[40,0,42,14],[4,5,4,6],[4,7,4,8],[4,9,4,10],[4,11,4,12],[4,13,4,14],[33,18,33,19],[2,5,2,12],[34,13,34,14],[36,5,36,6],[34,5,34,6],[34,7,34,8],[34,9,34,10],[34,11,34,12]]}
["De groene vensters dienen gevuld te worden met de gegevens van de organisatie."]
["De sheet 'Toelichting' bevat noodzakelijke informatie voor het invullen van de groene vensters. Lees deze dus rustig door alvorens de groene vensters in te vullen. "]
["Bouwsteen:",{"$nulls":4},"Dyslexie - Diagnostiek (45A45) TRAJECT"]
[]
["CAO",null,"Vast component of cao afgeleid",null,null,"CAO WAOJ",null,"CAO WAOJ",null,"CAO WAOJ",null,"CAO Sociaal Werk",null,"CAO Jeugdzorg",{"$nulls":4},"Tariefstelling ZZP'er"]
["LOONKOSTEN PER UUR",{"$nulls":17},"Loonkosten per uur"]
["Ingezette functiewerkgroep en bijbehorend maandsalaris",{"$nulls":4},"FWG 20 - 5",1982.03,"FWG 30 - 8",2256,"FWG 25 - 7",2118,"Schaal 3 - 8",2193,"Schaal 3 - 7",2151.92]
["Bruto uurloon ",{"$nulls":5},{"$f":"G7/156","v":12.705320512820512},null,{"$f":"I7/156","v":14.461538461538462},null,{"$f":"K7/156","v":13.576923076923077},null,{"$f":"M7/156","v":14.057692307692308},null,{"$f":"O7/156","v":13.794358974358975}]
["Vakantietoeslag",null,"Ja",null,null,{"$f":"IF(F5<>\"\",8%,\"\")","v":0.08},{"$f":"F9*G8","v":1.0164256410256409},{"$f":"IF(H5<>\"\",8%,\"\")","v":0.08},{"$f":"H9*I8","v":1.1569230769230769},{"$f":"IF(J5<>\"\",8%,\"\")","v":0.08},{"$f":"J9*K8","v":1.0861538461538462},{"$f":"IF(L5<>\"\",8%,\"\")","v":0.08},{"$f":"L9*M8","v":1.1246153846153848},{"$f":"IF(N5<>\"\",8%,\"\")","v":0.08},{"$f":"O8*N9","v":1.103548717948718}]
["Bruto uurloon incl. vakantietoeslag",{"$nulls":5},{"$f":"G8+G9","v":13.721746153846153},null,{"$f":"I8+I9","v":15.618461538461538},null,{"$f":"K8+K9","v":14.663076923076924},null,{"$f":"M8+M9","v":15.182307692307694},null,{"$f":"O8+O9","v":14.897907692307692}]
["Eindejaarsuitkering ",null,"Ja",null,null,{"$f":"VLOOKUP(F5,Toelichting!$A$39:$C$44,2,0)","v":0},{"$f":"F11*G8","v":0},{"$f":"VLOOKUP(H5,Toelichting!$A$39:$C$44,2,0)","v":0},{"$f":"H11*I8","v":0},{"$f":"VLOOKUP(J5,Toelichting!$A$39:$C$44,2,0)","v":0},{"$f":"J11*K8","v":0},{"$f":"VLOOKUP(L5,Toelichting!$A$39:$C$44,2,0)","v":8.3000000000000004E-2},{"$f":"L11*M8","v":1.1667884615384616},{"$f":"VLOOKUP(N5,Toelichting!$A$39:$C$44,2,0)","v":8.3000000000000004E-2},{"$f":"N11*O8","v":1.144931794871795}]
["Onregelmatigheidstoeslag over bruto uurloon incl. vakantietoeslag",{"$nulls":4},0.01,{"$f":"F12*G10","v":0.13721746153846154},0.01,{"$f":"H12*I10","v":0.15618461538461539},0.01,{"$f":"J12*K10","v":0.14663076923076923},0.01,{"$f":"L12*M10","v":0.15182307692307695},0.01,{"$f":"N12*O10","v":0.14897907692307694}]
["Totaal bruto uurloon",null,null,null,{"$f":"SUM(E$9:E$11)","v":0},null,{"$f":"SUM(G$10:G$12)","v":13.858963615384615},null,{"$f":"SUM(I$10:I$12)","v":15.774646153846154},null,{"$f":"SUM(K$10:K$12)","v":14.809707692307693},null,{"$f":"SUM(M$10:M$12)","v":16.500919230769231},null,{"$f":"SUM(O$10:O$12)","v":16.191818564102565}]
["totale sociale lasten",{"$nulls":4},0.1739,null,0.1739,null,0.1739,null,0.1739,null,0.1739]
["werkgeversdeel OP",{"$nulls":4},{"$f":"(((G13*1878)-Toelichting!$B$46)*Toelichting!$B$47/(G13*1878))*0.5","v":6.140258187745877E-2},null,{"$f":"(((I13*1878)-Toelichting!$B$46)*Toelichting!$B$47/(I13*1878))*0.5","v":6.8215086151852664E-2},null,{"$f":"(((K13*1878)-Toelichting!$B$46)*Toelichting!$B$47/(K13*1878))*0.5","v":6.5003887799140528E-2},null,{"$f":"(((M13*1878)-Toelichting!$B$46)*Toelichting!$B$47/(M13*1878))*0.5","v":7.0384317182305631E-2},null,{"$f":"(((O13*1878)-Toelichting!$B$46)*Toelichting!$B$47/(O13*1878))*0.5","v":6.9484882142828858E-2}]
{"$rows_left_out":26}
{"sheet":"Dyslexie - 45A64","index":2,"n_rows":40,"n_cols":21,"rows_kept":40,"cut":false,"hidden":false,"merged":[[36,5,36,6],[40,0,42,14],[33,18,33,19],[34,5,34,6],[34,7,34,8],[34,9,34,10],[34,11,34,12],[34,13,34,14],[4,13,4,14],[2,5,2,12],[4,5,4,6],[4,7,4,8],[4,9,4,10],[4,11,4,12]]}
["De groene vensters dienen gevuld te worden met de gegevens van de organisatie."]
["De sheet 'Toelichting' bevat noodzakelijke informatie voor het invullen van de groene vensters. Lees deze dus rustig door alvorens de groene vensters in te vullen. "]
["Bouwsteen:",{"$nulls":4},"Dyslexie - Behandeling (45A64) TRAJECT"]
[]
["CAO",null,"Vast component of cao afgeleid",null,null,"CAO WAOJ",null,"CAO WAOJ",null,"CAO WAOJ",null,"CAO Sociaal Werk",null,"CAO Jeugdzorg",{"$nulls":4},"Tariefstelling ZZP'er"]
["LOONKOSTEN PER UUR",{"$nulls":17},"Loonkosten per uur"]
["Ingezette functiewerkgroep en bijbehorend maandsalaris",{"$nulls":4},"FWG 20 - 5",1982.03,"FWG 30 - 8",2256,"FWG 25 - 7",2118,"Schaal 3 - 8",2193,"Schaal 3 - 7",2151.92]
["Bruto uurloon ",{"$nulls":5},{"$f":"G7/156","v":12.705320512820512},null,{"$f":"I7/156","v":14.461538461538462},null,{"$f":"K7/156","v":13.576923076923077},null,{"$f":"M7/156","v":14.057692307692308},null,{"$f":"O7/156","v":13.794358974358975}]
["Vakantietoeslag",null,"Ja",null,null,{"$f":"IF(F5<>\"\",8%,\"\")","v":0.08},{"$f":"F9*G8","v":1.0164256410256409},{"$f":"IF(H5<>\"\",8%,\"\")","v":0.08},{"$f":"H9*I8","v":1.1569230769230769},{"$f":"IF(J5<>\"\",8%,\"\")","v":0.08},{"$f":"J9*K8","v":1.0861538461538462},{"$f":"IF(L5<>\"\",8%,\"\")","v":0.08},{"$f":"L9*M8","v":1.1246153846153848},{"$f":"IF(N5<>\"\",8%,\"\")","v":0.08},{"$f":"O8*N9","v":1.103548717948718}]
["Bruto uurloon incl. vakantietoeslag",{"$nulls":5},{"$f":"G8+G9","v":13.721746153846153},null,{"$f":"I8+I9","v":15.618461538461538},null,{"$f":"K8+K9","v":14.663076923076924},null,{"$f":"M8+M9","v":15.182307692307694},null,{"$f":"O8+O9","v":14.897907692307692}]
["Eindejaarsuitkering ",null,"Ja",null,null,{"$f":"VLOOKUP(F5,Toelichting!$A$39:$C$44,2,0)","v":0},{"$f":"F11*G8","v":0},{"$f":"VLOOKUP(H5,Toelichting!$A$39:$C$44,2,0)","v":0},{"$f":"H11*I8","v":0},{"$f":"VLOOKUP(J5,Toelichting!$A$39:$C$44,2,0)","v":0},{"$f":"J11*K8","v":0},{"$f":"VLOOKUP(L5,Toelichting!$A$39:$C$44,2,0)","v":8.3000000000000004E-2},{"$f":"L11*M8","v":1.1667884615384616},{"$f":"VLOOKUP(N5,Toelichting!$A$39:$C$44,2,0)","v":8.3000000000000004E-2},{"$f":"N11*O8","v":1.144931794871795}]
["Onregelmatigheidstoeslag over bruto uurloon incl. vakantietoeslag",{"$nulls":4},0.01,{"$f":"F12*G10","v":0.13721746153846154},0.01,{"$f":"H12*I10","v":0.15618461538461539},0.01,{"$f":"J12*K10","v":0.14663076923076923},0.01,{"$f":"L12*M10","v":0.15182307692307695},0.01,{"$f":"N12*O10","v":0.14897907692307694}]
["Totaal bruto uurloon",null,null,null,{"$f":"SUM(E$9:E$11)","v":0},null,{"$f":"SUM(G$10:G$12)","v":13.858963615384615},null,{"$f":"SUM(I$10:I$12)","v":15.774646153846154},null,{"$f":"SUM(K$10:K$12)","v":14.809707692307693},null,{"$f":"SUM(M$10:M$12)","v":16.500919230769231},null,{"$f":"SUM(O$10:O$12)","v":16.191818564102565}]
["totale sociale lasten",{"$nulls":4},0.1739,null,0.1739,null,0.1739,null,0.1739,null,0.1739]
["werkgeversdeel OP",{"$nulls":4},{"$f":"(((G13*1878)-Toelichting!$B$46)*Toelichting!$B$47/(G13*1878))*0.5","v":6.140258187745877E-2},null,{"$f":"(((I13*1878)-Toelichting!$B$46)*Toelichting!$B$47/(I13*1878))*0.5","v":6.8215086151852664E-2},null,{"$f":"(((K13*1878)-Toelichting!$B$46)*Toelichting!$B$47/(K13*1878))*0.5","v":6.5003887799140528E-2},null,{"$f":"(((M13*1878)-Toelichting!$B$46)*Toelichting!$B$47/(M13*1878))*0.5","v":7.0384317182305631E-2},null,{"$f":"(((O13*1878)-Toelichting!$B$46)*Toelichting!$B$47/(O13*1878))*0.5","v":6.9484882142828858E-2}]
{"$rows_left_out":26}
{"sheet":"Toelichting","index":3,"n_rows":48,"n_cols":3,"rows_kept":48,"cut":false,"hidden":false,"merged":[]}
["Deze sheet verschaft achterliggende informatie bij de factoren die samen de kostprijs per bouwsteen bepalen. "]
["Kostprijsfactor ","Toelichting"]
["CAO","Zes CAOs (Jeugdzorg, Gehandicaptenzorg, GGZ, Sociaal Werk en VVT; WAOJ) kunnen van toepassing zijn op de verschillende bouwstenen. Deze rij geeft de mogelijkheid om - middels een drop-down menu -  per bouwsteen aan te geven welke CAOs - en daarmee kostprijsfactoren - van toepassing zijn. "]
["Ingezette functiewerkgroep","In deze rij kunnen zorgaanbieders aangeven welke functiewerkgroep en trede zij per CAO in zullen zetten. "]
["Bruto uurloon","Het bruto uurloon hangt af van de positie in de salarisschaal binnen de van toepassing zijnde CAO. Vanuit het bruto fulltime maandsalaris zoals opgenomen in de CAOs wordt het uurtarief berekend. Hierbij wordt uitgegaan van een 36e urige werkwerkweek (1878 uren) op jaarbasis bij een fulltime positie, hetgeen neerkomt op 156 uren per maand."]
["Vakantietoeslag","Vanuit de CAOs vloeit voort dat de vakantietoeslag 8% van het feitelijk verdiende loont betreft. "]
["Eindejaarsuitkering","De eindejaarsuitkering is afhankelijk van de betreffende CAO. De percentages per 01-01-2019 bedragen:\nVVT: 8,33%\nGGZ: 8,33%\nJeugdzorg: 8,30%\nGHZ: 7,05%\nSociaal Werk: 8,30% \nWAOJ: het betreft hier een  winstuitkering van ten hoogste 8%. Aangezien dit percentage organisatie-afhankelijk is, vragen we zorgaanbieders hier zelf het gemiddelde percentage in te vullen. "]
["Totale pensioenpremies en sociale lasten","Het totale bedrag voor het werkgeversdeel van pensioenpremies en sociale lasten wordt berekend op een aparte sheet. Aldaar is tevens een uitleg per factor opgenomen.\nDe vooraf berekende percentages kunnen voor uw organisatie afwijken: overschrijf in dat geval de formules in de betreffende cellen met de realistische waardes."]
["Verlof","Het aantal verlofuren is afhankelijk van de CAO. Het aantal verlofuren bedraagt respectievelijk: \nVVT: 237,5\nGGZ: 201\nJeugdzorg: 200\nGHZ: 114 + een afhankelijk component. Een fictief totaal is daarom gebaseerd op de andere CAO's.\nSociaal Werk: 170 + een afhankelijk component. Een fictief totaal is daarom gebaseerd op de andere CAO's.\nHet veld verlof is standaard vooraf ingevuld, maar kan worden overschreven als er sprake is van extra bovenwettelijk verlof."]
["Scholing","Het percentage van de uren dat beschikbaar is voor scholing is afhankelijk van de CAO. De percentages bedragen:\nVVT: 2,0%\nGGZ: 2,0% (deze informatie mist uit de CAO en is gebaseerd op de andere CAO's)\nJeugdzorg: 1,5%\nGHZ: 2,0%\nSociaal Werk: 2,0% (deze informatie mist uit de CAO en is gebaseerd op de andere CAO's) \nWAOJ: 2,0% (deze informatie mist uit de CAO en is gebaseerd op de andere CAO's)\nHet veld scholing is standaard vooraf ingevuld, maar kan worden overschreven als er sprake is van extra extra scholingstijd."]
["Ziekteverzuim","Ziekteverzuim wisselt per organisatie.\nHet gemiddelde in de sector Jeugdhulp bedroeg over 2018 6,7% volgens het CBS. "]
["Cliëntgebonden tijd ","Onder cliëntgebonden tijd wordt verstaan: \nDirect cliëntgebonden tijd. Dit betreft de contacttijd die een professional aan een cliënt besteedt bij een activititeit: face to face contacttijd, telefonische contacttijd (ear to ear), elektronische contacttijd (bit-to-bit)                                                                                                                                       Indirect cliëntgebonden tijd: indirecte tijd die samenhangt met het uitvoeren van een direct cliëntgebonden activiteit, zoals een behandel-, begeleidings- of verplegingsactiviteit. Denk hierbij aan: het voorbereiden van een activiteit, verslaglegging en administratie in het kader van de activiteit, het opruimen van de speelkamer bij een behandelcontact met kleine kinderen, hersteltijd na een intensieve behandelsessie. De reistijd van cliënt naar cliënt valt hier tevens onder. "]
["Wel gewerkte, niet-declarabele activiteiten","Hieronder vallen onder andere het lezen van vakliteratuur, algemene vergaderingen en intervisiebijeenkomsten. Tevens moet hier de tijd voor no-shows in worden opgenomen, aangezien deze tijd niet gedeclareerd mag worden. De reistijd van cliënt naar cliënt aansluitend bij een no-show of overige indirect cliëntgebonden werkzaamheden die een zorgverlener in deze tijd oppakt (tevens voor andere cliënten), mogen wél gedeclareerd worden (en gelden dus niet als opslag voor niet-declarabele tijd bij een no-show)."]
["Onregelmatigheidstoeslag","Deze rij laat toe om een extra uitkering volgend uit onregelmatige diensten op te nemen middels een opslag over het bruto-uurloon inclusief vakantiegeld. "]
["Reiskosten cliënt naar cliënt","Zorgaanbieders kunnen hier de reiskosten van cliënt naar cliënt toeberekend per uur invullen. Onder deze reistijd valt niet de tijd die nodig is om op het terrein van de eigen organisatie de cliënt te bereiken, ook niet als de instelling op meerdere locaties werkt. Voor de op de lijst activiteiten en verrichtingen voorkomende categoriën pré-intake en algemeen indirecte tijd geldt dat er geen reistijd mag worden geregistreerd, maar alleen 'wel gewerkte - niet direct cliëntgebonden' tijd."]
{"$rows_left_out":34}
{"sheet":"Bruto-netto en pensioen","index":4,"n_rows":39,"n_cols":17,"rows_kept":39,"cut":false,"hidden":false,"merged":[[2,9,2,10],[2,11,2,12],[0,0,0,8],[2,1,2,2],[2,3,2,4],[2,5,2,6],[2,7,2,8]]}
["Bruto-netto berekening"]
[{"$nulls":14},"Elementen sociale lasten"]
["Percentages per CAO","CAO VVT",null,"CAO GGZ",null,"CAO Jeugdzorg",null,"CAO GHZ",null,"CAO Sociaal Werk",null,"CAO WAOJ",null,null,"WGA / WIA (+ WKO)",6.7699999999999996E-2,"Het bedraagt hier de premie voor 2019, bestaande uit een basispremie (6,27%) en een verplichte bijdrage van de werkgever in kinderopvang (0,5%)"]
["Bruto uren",1,null,1,null,1,null,1,null,1,null,1,null,null,"WW",2.07E-2,"Het bedraagt hier de premie voor 2019"]
["Verlof",{"$f":"(237.5)/(36/7*365)","v":0.1265220700152207},{"$f":"B5/$B$9","v":0.16294354949367437},{"$f":"(201)/(36/7*365)","v":0.10707762557077624},{"$f":"D5/D9","v":0.13453274968876752},{"$f":"(200)/(36/7*365)","v":0.106544901065449},{"$f":"F5/F9","v":0.13293932649138931},0.107,{"$f":"H5/H9","v":0.13442211055276382},0.107,{"$f":"J5/J9","v":0.13442211055276382},{"$f":"(190)/(38/7*365)","v":9.5890410958904104E-2},{"$f":"L5/L9","v":0.11880717595342759},null,"Sectorfonds",4.7000000000000002E-3,"Het bedraagt hier de premie voor 2019, sector gezondheid"]
["Scholing",0.02,{"$f":"B6/$B$9","v":2.5757332214699322E-2},0.02,{"$f":"D6/D9","v":2.512807861990626E-2},1.4999999999999999E-2,{"$f":"F6/F9","v":1.8715958036752026E-2},0.02,{"$f":"H6/H9","v":2.5125628140703515E-2},0.02,{"$f":"J6/J9","v":2.5125628140703515E-2},0.02,{"$f":"L6/L9","v":2.4779782413143471E-2},null,"ZVW",6.9500000000000006E-2,"Het bedraagt hier de premie voor 2019"]
["Ziekteverzuim",6.7000000000000004E-2,{"$f":"B7/B9","v":8.6287062919242735E-2},6.7000000000000004E-2,{"$f":"D7/D9","v":8.4179063376685972E-2},6.7000000000000004E-2,{"$f":"F7/F9","v":8.3597945897492379E-2},6.7000000000000004E-2,{"$f":"H7/H9","v":8.4170854271356788E-2},6.7000000000000004E-2,{"$f":"J7/J9","v":8.4170854271356788E-2},6.7000000000000004E-2,{"$f":"L7/L9","v":8.3012271084030628E-2},null,"WHK",1.1299999999999999E-2,"Het landelijke percentage voor 2019 is door UWV/SZW vastgesteld op: 1,13% (WGA: 0,80% + Ziektewet Flex 0,33% = 1,13%)."]
["Wel gewerkte, niet-direct (cliëntgebonden) activiteit",0.01,{"$f":"B8/B9","v":1.2878666107349661E-2},0.01,{"$f":"D8/D9","v":1.256403930995313E-2},0.01,{"$f":"F8/F9","v":1.2477305357834685E-2},0.01,{"$f":"H8/H9","v":1.2562814070351758E-2},0.01,{"$f":"J8/J9","v":1.2562814070351758E-2},0.01,{"$f":"L8/L9","v":1.2389891206571736E-2},null,"WGA eigen risico; herverzekerd",0,"Het eigen risico is vastgesteld op 0%, waarbij ervan uit wordt gegaan dat het WGA volledig geregeld is via het UWV. "]
["Netto uren",{"$f":"B4-B5-B6-B7-B8","v":0.77647792998477927},null,{"$f":"D4-D5-D6-D7-D8","v":0.79592237442922364},null,{"$f":"F4-F5-F6-F7-F8","v":0.80145509893455102},null,{"$f":"H4-H5-H6-H7-H8","v":0.79600000000000004},null,{"$f":"J4-SUM(J5:J8)","v":0.79600000000000004},null,{"$f":"L4-(SUM(L5:L8))","v":0.80710958904109587},null,null,"Totaal Sociale lasten",{"$f":"SUM(P$3:P$8)","v":0.1739}]
[]
[]
["De netto berekening is gebaseerd op de aangegeven verplichte factoren (o.g.v. de CAO's en wetgeving)"]
["van improductiviteit. Deze verplichte factoren gelden evenzeer voor de (kosten van) vervanging gedurende verlof, scholing en ziekteverzuim.",{"$nulls":13},"Elementen pensioen - voorbeeld"]
["Dit is derhalve in de rekenpercentages meegenomen.",{"$nulls":14},"CAO VVT"]
[{"$nulls":14},"Fulltime salaris",{"$f":"'Dyslexie - 45A45'!G8*1878","v":23860.591923076921}]
{"$rows_left_out":25}
{"sheet":"Overzicht bouwstenen","index":5,"n_rows":43,"n_cols":15,"rows_kept":43,"cut":false,"hidden":false,"merged":[[1,1,1,4],[1,6,1,9],[1,11,1,14]]}
[]
[null,"Ambulant",{"$nulls":4},"Daghulp en dagbesteding",{"$nulls":4},"Jeugdhulp met verblijf"]
[null,"Bouwsteen","interventie-niveau","code","eenheid",null,"Bouwsteen","interventie-niveau","code","eenheid",null,"Bouwsteen","interventie-niveau","code","eenheid"]
[null,"Meedoen en zelfredzaamheid","Licht","50A03","per uur",null,"Meedoen en zelfredzaamheid","Dagbesteding basis","41A19","dagdeel",null,"Meedoen en zelfredzaamheid","Verblijf basis","43A15","etmaal"]
[null,null,"Midden","50A04","per uur",null,null,"Dagbesteding basis intensief","41A20","dagdeel",null,null,"Verblijf specialistisch","43A16","etmaal"]
[null,null,"Zwaar","50A05","per uur",null,null,"Dagbesteding licht specialistisch","41A21","dagdeel",null,null,"Zelfstandigheidstraining","43A17","etmaal"]
[{"$nulls":7},"Dagbesteding intensief specialistisch","50A06","dagdeel",null,null,"Logeren basis","43A32","etmaal"]
[{"$nulls":12},"Logeren specialistisch","43A33","etmaal"]
[]
[null,"Gezond zijn","Licht","45A33","traject",null,"Gezond zijn","Dagbehandeling","41A08","dagdeel",null,"Gezond zijn","Verblijf basis","43A18","etmaal"]
[null,null,"Midden","45A34","per uur",{"$nulls":7},"Verblijf specialistisch","43A19","etmaal"]
[null,null,"Zwaar","45A35","per uur",{"$nulls":7},"Intramur. Behand. Verslaving jeugd","43A01","etmaal"]
[null,null,"Medicijncontrole","45A14","traject (jaar)",{"$nulls":7},"Pilot bouwsteen","43B16","etmaal"]
[null,null,"Fact","45A41","traject (maand)",{"$nulls":7},"Intramur. Behand. Verslaving gezin","43B10","etmaal"]
[null,null,"Vaktherapie","nieuw","per uur",{"$nulls":7},"intramuraal zeer specialistisch","43B19","etmaal"]
{"$rows_left_out":29}
{"sheet":"Invulblad CAO","index":6,"n_rows":55,"n_cols":13,"rows_kept":55,"cut":false,"hidden":true,"merged":[[2,9,2,10],[2,6,2,7],[3,6,3,7],[3,9,3,10],[54,6,54,7],[54,9,54,10]]}
["De groene vensters dienen gevuld te worden met de gegevens van de organisatie."]
[]
["Ondersteuningsvorm: benaming van gemeente",{"$nulls":5},"HH-1",null,null,"HH-2"]
["CAO keuze",{"$nulls":5},"VVT",null,null,"VVT",null,null,"[Datum CAO]"]
["FWG schaal",{"$nulls":5},"FWG10","FWG15",null,"FWG15","FWG20"]
["Periodiek",{"$nulls":5},3,7,null,7,4]
["Inzetmix per FWG schaal",{"$nulls":5},0.75,0.25,null,0.6,0.4]
[]
[null,null,"Vaste componenten of cao afgeleid",null,"%",{"$nulls":7},"Pas toe en leg uit"]
["LOONKOSTEN PER UUR"]
["Bruto uurloon cao",{"$nulls":5},{"$f":"VLOOKUP(G4&G5&G6,#REF!,6,0)","v":{"$error":"#REF!"}},{"$f":"VLOOKUP(G4&H5&H6,#REF!,6,0)","v":{"$error":"#REF!"}},null,{"$f":"VLOOKUP(J4&J5&J6,#REF!,6,0)","v":{"$error":"#REF!"}},{"$f":"VLOOKUP(J4&K5&K6,#REF!,6,0)","v":{"$error":"#REF!"}}]
["Vakantietoeslag (minimum cao bepaald 0,98)",null,"Ja",null,0.08,null,{"$f":"IF((G$11*$E12)>0.98,(G$11*$E12),0.98)","v":{"$error":"#REF!"}},{"$f":"IF((H$11*$E12)>0.98,(H$11*$E12),0.98)","v":{"$error":"#REF!"}},null,{"$error":"#REF!"},{"$error":"#REF!"}]
["Eindejaarsuitkering (minimum cao bepaald (0,94)",null,"Ja",null,7.3999999999999996E-2,null,{"$f":"IF((G$11*$E13)>0.94,(G$11*$E13),0.94)","v":{"$error":"#REF!"}},{"$f":"IF((H$11*$E13)>0.94,(H$11*$E13),0.94)","v":{"$error":"#REF!"}},null,{"$error":"#REF!"},{"$error":"#REF!"}]
["Totaal bruto uurloon",null,null,null,{"$f":"SUM(E12:E13)","v":0.154},null,{"$f":"SUM(G11:G13)","v":{"$error":"#REF!"}},{"$f":"SUM(H11:H13)","v":{"$error":"#REF!"}},null,{"$error":"#REF!"},{"$error":"#REF!"}]
[]
{"$rows_left_out":41}
{"sheet":"Pensioenpremie CAO","index":7,"n_rows":26,"n_cols":5,"rows_kept":26,"cut":false,"hidden":true,"merged":[[0,0,0,4]]}
["Berekening pensioenpremie (VVT / VGN beide Pensioenfonds PZW)"]
[]
["Ondersteuningsvorm; benaming gemeente ",{"$f":"'Invulblad CAO'!G3","v":"HH-1"},{"$f":"'Invulblad CAO'!G3","v":"HH-1"},{"$f":"'Invulblad CAO'!J3","v":"HH-2"},{"$f":"'Invulblad CAO'!J3","v":"HH-2"}]
["Cao",{"$f":"'Invulblad CAO'!G4","v":"VVT"},{"$f":"'Invulblad CAO'!G4","v":"VVT"},{"$f":"'Invulblad CAO'!J4","v":"VVT"},{"$f":"'Invulblad CAO'!J4","v":"VVT"}]
["FWG",{"$f":"'Invulblad CAO'!G5","v":"FWG10"},{"$f":"'Invulblad CAO'!H5","v":"FWG15"},{"$f":"'Invulblad CAO'!J5","v":"FWG15"},{"$f":"'Invulblad CAO'!K5","v":"FWG20"}]
[]
["Totaal Bruto uurloon",{"$f":"'Invulblad CAO'!G14","v":{"$error":"#REF!"}},{"$f":"'Invulblad CAO'!H14","v":{"$error":"#REF!"}},{"$f":"'Invulblad CAO'!J14","v":{"$error":"#REF!"}},{"$f":"'Invulblad CAO'!K14","v":{"$error":"#REF!"}}]
["Fulltime salaris",{"$f":"B7*1878","v":{"$error":"#REF!"}},{"$f":"C7*1878","v":{"$error":"#REF!"}},{"$error":"#REF!"},{"$error":"#REF!"}]
[]
["OP Premie vaststellen"]
["% (werkgevers +werknemersdeel)",0.23499999999999999,0.23499999999999999,0.23499999999999999,0.23499999999999999]
["Franchise ",11829,11829,11829,11829]
["Grondslag",{"$f":"B8-B12","v":{"$error":"#REF!"}},{"$f":"C8-C12","v":{"$error":"#REF!"}},{"$f":"D8-D12","v":{"$error":"#REF!"}},{"$f":"E8-E12","v":{"$error":"#REF!"}}]
["Premie (per jaar)",{"$f":"B13*B11","v":{"$error":"#REF!"}},{"$f":"C13*C11","v":{"$error":"#REF!"}},{"$f":"D13*D11","v":{"$error":"#REF!"}},{"$f":"E13*E11","v":{"$error":"#REF!"}}]
[]
{"$rows_left_out":11}